Build: #45 failed Changes by 8 people

Build result summary

Details

Completed
Duration
1 minute
Labels
None
Show more

No failed tests found, a possible compilation error occurred.

Responsible

No one has taken responsibility for this failure

Code commits

Author Commit Message Commit date
Bonita CI &lt;ci@bonitasoft.com&gt; Bonita CI <ci@bonitasoft.com> 54d1854cdb554205f7c23da2ef5a698d98cacb73 [ENGINE RELEASE] Prepare next development version 7.4.4-SNAPSHOT
Baptiste Mesta &lt;baptiste.mesta@gmail.com&gt; Baptiste Mesta <baptiste.mesta@gmail.com> 02ddb53174a01c031ada26ba0a916a8464fee99d fix(wildfly): fix oracle xa connection property (#484)
In order to have XA working on wildfly + oracle, the xa-pool needs to have these properties set in the standalone configuration file:
```xml
<is-same-rm-override>false</is-same-rm-override>
<no-tx-separate-pools>true</no-tx-separate-pools>
```
Closes [BS-16213](BS-16213">https://bonitasoft.atlassian.net/browse/BS-16213)
danila_mazour &lt;danila.mazour@bonitasoft.com&gt; danila_mazour <danila.mazour@bonitasoft.com> 9b57d7fed570efac510098737dc7ee54a4902207 fix(UserMembership): retrieve groupParentPath when converting UserMembership (#481)
The groupParentPath is taken from the group and passed to the SUserMembership (server model) upon creation of the UserMembership (client model).

Closes [BS-16233](BS-16233">https://bonitasoft.atlassian.net/browse/BS-16233)
Laurent Leseigneur &lt;laurent.leseigneur@bonitasoft.com&gt; Laurent Leseigneur <laurent.leseigneur@bonitasoft.com> 92e0adf01f10e67ab846308248e718f5da980eb3 tr(random test): fix tests (#480)
* random test fail when start date was in the same millis
* moved assertions to assertJ
Baptiste Mesta &lt;baptiste.mesta@gmail.com&gt; Baptiste Mesta <baptiste.mesta@gmail.com> 1da734d3f764383dd47c6080667e120ebad1e649 fix(bdm): disable FAIL_ON_EMPTY_BEANS serialization opt (#452)
* fix(bdm): disable FAIL_ON_EMPTY_BEANS serializatin opt

when deserializing bdm entity if the serialized object contains a lazy
entity in composition, serialization can fail. to avoid that the
exception explain that we can disable that property on the serializer in
order to avoid the exception.
That is the case here. The proxy will  be recreated client side.

* change test so it fails before fix (add a capital letter)

Closes [BS-16031](BS-16031">https://bonitasoft.atlassian.net/browse/BS-16031)

JIRA issues

IssueDescriptionStatus
6 more issues…
Unknown Issue TypeBS-14579Could not obtain issue details from JIRA
Unknown Issue TypeBS-15076Could not obtain issue details from JIRA
Unknown Issue TypeBS-15921Could not obtain issue details from JIRA
Unknown Issue TypeBS-16031Could not obtain issue details from JIRA
Unknown Issue TypeBS-16106Could not obtain issue details from JIRA

Error summary for Default Job

The job generated some errors, drill down into the full build log for more details.

ERROR: Error during Sonar runner execution
org.sonar.runner.impl.RunnerException: Unable to execute Sonar
        at org.sonar.runner.impl.BatchLauncher$1.delegateExecution(BatchLauncher.java:91)
        at org.sonar.runner.impl.BatchLauncher$1.run(BatchLauncher.java:75)
        at java.security.AccessController.doPrivileged(Native Method)
        at org.sonar.runner.impl.BatchLauncher.doExecute(BatchLauncher.java:69)
        at org.sonar.runner.impl.BatchLauncher.execute(BatchLauncher.java:50)
        at org.sonar.runner.api.EmbeddedRunner.doExecute(EmbeddedRunner.java:102)
        at org.sonar.runner.api.Runner.execute(Runner.java:100)
        at org.sonar.runner.Main.executeTask(Main.java:70)
        at org.sonar.runner.Main.execute(Main.java:59)
        at org.sonar.runner.Main.main(Main.java:53)
Caused by: org.sonar.duplications.DuplicationsException: Unable to build statement from token : 'package'[14,0]
        at org.sonar.duplications.statement.StatementChunker.chunk(StatementChunker.java:50)
        at org.sonar.plugins.cpd.JavaCpdEngine.createIndex(JavaCpdEngine.java:140)
        at org.sonar.plugins.cpd.JavaCpdEngine.analyse(JavaCpdEngine.java:120)
        at org.sonar.plugins.cpd.CpdSensor.execute(CpdSensor.java:87)
        at org.sonar.batch.scan.SensorWrapper.analyse(SensorWrapper.java:70)
        at org.sonar.batch.phases.SensorsExecutor.executeSensor(SensorsExecutor.java:79)
        at org.sonar.batch.phases.SensorsExecutor.execute(SensorsExecutor.java:70)
        at org.sonar.batch.phases.PhaseExecutor.execute(PhaseExecutor.java:119)
        at org.sonar.batch.scan.ModuleScanContainer.doAfterStart(ModuleScanContainer.java:194)
        at org.sonar.api.platform.ComponentContainer.startComponents(ComponentContainer.java:92)
        at org.sonar.api.platform.ComponentContainer.execute(ComponentContainer.java:77)
        at org.sonar.batch.scan.ProjectScanContainer.scan(ProjectScanContainer.java:233)
        at org.sonar.batch.scan.ProjectScanContainer.scanRecursively(ProjectScanContainer.java:228)
        at org.sonar.batch.scan.ProjectScanContainer.doAfterStart(ProjectScanContainer.java:221)
        at org.sonar.api.platform.ComponentContainer.startComponents(ComponentContainer.java:92)
        at org.sonar.api.platform.ComponentContainer.execute(ComponentContainer.java:77)
        at org.sonar.batch.scan.ScanTask.scan(ScanTask.java:64)
        at org.sonar.batch.scan.ScanTask.execute(ScanTask.java:51)
        at org.sonar.batch.bootstrap.TaskContainer.doAfterStart(TaskContainer.java:125)
        at org.sonar.api.platform.ComponentContainer.startComponents(ComponentContainer.java:92)
        at org.sonar.api.platform.ComponentContainer.execute(ComponentContainer.java:77)
        at org.sonar.batch.bootstrap.BootstrapContainer.executeTask(BootstrapContainer.java:173)
        at org.sonar.batch.bootstrapper.Batch.executeTask(Batch.java:95)
        at org.sonar.batch.bootstrapper.Batch.execute(Batch.java:67)
        at org.sonar.runner.batch.IsolatedLauncher.execute(IsolatedLauncher.java:48)
        at sun.reflect.NativeMethodAccessorImpl.invoke0(Native Method)
        at sun.reflect.NativeMethodAccessorImpl.invoke(NativeMethodAccessorImpl.java:62)
        at sun.reflect.DelegatingMethodAccessorImpl.invoke(DelegatingMethodAccessorImpl.java:43)
        at java.lang.reflect.Method.invoke(Method.java:497)
        at org.sonar.runner.impl.BatchLauncher$1.delegateExecution(BatchLauncher.java:87)
        ... 9 more
Caused by: java.lang.IllegalStateException: None of the statement channel has been able to consume token: 'package'[14,0]
        at org.sonar.duplications.statement.StatementChannelDisptacher.consume(StatementChannelDisptacher.java:47)
        at org.sonar.duplications.statement.StatementChunker.chunk(StatementChunker.java:47)
        ... 38 more