Build: #215 failed Changes by 3 people

Build result summary

Details

Completed
Duration
6 minutes
Labels
None
Show more

No failed tests found, a possible compilation error occurred.

Responsible

This build has been failing since #212
No one has taken responsibility

Code commits

Author Commit Message Commit date
Laurent Goubet Laurent Goubet 2f5aacfc6d53177a392dcb6f8bf30aca8b710aaa Project contains UTF-8 characters, change properties accordingly
Change-Id: Ia95040c465bbbb267dc83df2fabebbfdc55eb9c1
Laurent Goubet Laurent Goubet fe7703722ac84b12e4ea820e61a76239082b6da9 Remove inexistant source folder from buildpath
Change-Id: Ia76a152f91ac7dcbe790234840d4a22968f8076c
Yvan LUSSAUD Yvan LUSSAUD 875cf6ddc89692b6a2ca7d945d09f02d43165d9e [509824] Access to non-existing fields impacts evaluation times
The exception thrown when a feature is not found was expensive.
The service now return a Nothing is the feature is not found.

Bug: 509824
Change-Id: I5535c31b8e777ce4854557b2587dab897c86e4bd
C??dric Brun C??dric Brun 3221ca1c1cae157e50eb36f451aa9dd640700f6a [509824] Add test which fails when overhead of error access > 30% time
Bug: 509824
Change-Id: I6f035a31e877a2732781a5028b77d1a6e44a208c

JIRA issues

IssueDescriptionStatus
Unknown Issue TypeUTF-8Could not obtain issue details from JIRA

Error summary for Default Job

The job generated some errors, drill down into the full build log for more details.

ERROR: Error during Sonar runner execution
org.sonar.runner.impl.RunnerException: Unable to execute Sonar
        at org.sonar.runner.impl.BatchLauncher$1.delegateExecution(BatchLauncher.java:91)
        at org.sonar.runner.impl.BatchLauncher$1.run(BatchLauncher.java:75)
        at java.security.AccessController.doPrivileged(Native Method)
        at org.sonar.runner.impl.BatchLauncher.doExecute(BatchLauncher.java:69)
        at org.sonar.runner.impl.BatchLauncher.execute(BatchLauncher.java:50)
        at org.sonar.runner.api.EmbeddedRunner.doExecute(EmbeddedRunner.java:102)
        at org.sonar.runner.api.Runner.execute(Runner.java:100)
        at org.sonar.runner.Main.executeTask(Main.java:70)
        at org.sonar.runner.Main.execute(Main.java:59)
        at org.sonar.runner.Main.main(Main.java:53)
Caused by: org.sonar.duplications.DuplicationsException: Unable to build statement from token : 'package'[1,2]
        at org.sonar.duplications.statement.StatementChunker.chunk(StatementChunker.java:50)
        at org.sonar.scanner.cpd.deprecated.JavaCpdBlockIndexer.createIndex(JavaCpdBlockIndexer.java:96)
        at org.sonar.scanner.cpd.deprecated.JavaCpdBlockIndexer.index(JavaCpdBlockIndexer.java:80)
        at org.sonar.scanner.cpd.deprecated.DeprecatedCpdBlockIndexerSensor.execute(DeprecatedCpdBlockIndexerSensor.java:76)
        at org.sonar.scanner.sensor.SensorWrapper.analyse(SensorWrapper.java:53)
        at org.sonar.scanner.phases.SensorsExecutor.executeSensor(SensorsExecutor.java:57)
        at org.sonar.scanner.phases.SensorsExecutor.execute(SensorsExecutor.java:49)
        at org.sonar.scanner.phases.AbstractPhaseExecutor.execute(AbstractPhaseExecutor.java:74)
        at org.sonar.scanner.scan.ModuleScanContainer.doAfterStart(ModuleScanContainer.java:175)
        at org.sonar.core.platform.ComponentContainer.startComponents(ComponentContainer.java:143)
        at org.sonar.core.platform.ComponentContainer.execute(ComponentContainer.java:128)
        at org.sonar.scanner.scan.ProjectScanContainer.scan(ProjectScanContainer.java:262)
        at org.sonar.scanner.scan.ProjectScanContainer.scanRecursively(ProjectScanContainer.java:257)
        at org.sonar.scanner.scan.ProjectScanContainer.doAfterStart(ProjectScanContainer.java:247)
        at org.sonar.core.platform.ComponentContainer.startComponents(ComponentContainer.java:143)
        at org.sonar.core.platform.ComponentContainer.execute(ComponentContainer.java:128)
        at org.sonar.scanner.task.ScanTask.execute(ScanTask.java:47)
        at org.sonar.scanner.task.TaskContainer.doAfterStart(TaskContainer.java:86)
        at org.sonar.core.platform.ComponentContainer.startComponents(ComponentContainer.java:143)
        at org.sonar.core.platform.ComponentContainer.execute(ComponentContainer.java:128)
        at org.sonar.scanner.bootstrap.GlobalContainer.executeTask(GlobalContainer.java:118)
        at org.sonar.batch.bootstrapper.Batch.executeTask(Batch.java:117)
        at org.sonar.batch.bootstrapper.Batch.execute(Batch.java:77)
        at org.sonar.runner.batch.IsolatedLauncher.execute(IsolatedLauncher.java:48)
        at sun.reflect.NativeMethodAccessorImpl.invoke0(Native Method)
        at sun.reflect.NativeMethodAccessorImpl.invoke(NativeMethodAccessorImpl.java:62)
        at sun.reflect.DelegatingMethodAccessorImpl.invoke(DelegatingMethodAccessorImpl.java:43)
        at java.lang.reflect.Method.invoke(Method.java:497)
        at org.sonar.runner.impl.BatchLauncher$1.delegateExecution(BatchLauncher.java:87)
        ... 9 more
Caused by: java.lang.IllegalStateException: None of the statement channel has been able to consume token: 'package'[1,2]
        at org.sonar.duplications.statement.StatementChannelDisptacher.consume(StatementChannelDisptacher.java:46)
        at org.sonar.duplications.statement.StatementChunker.chunk(StatementChunker.java:47)
        ... 37 more